Information card for entry 7226763
Chemical name | (Z)-3-(3,4-dimethoxyphenyl)-2-(4-nitrophenyl)acrylonitrile |
Formula | C17 H14 N2 O4 |
Calculated formula | C17 H14 N2 O4 |
SMILES | O(c1c(OC)cc(cc1)/C=C(/c1ccc(N(=O)=O)cc1)C#N)C |
Title of publication | Isostructural polymorphs: qualitative insights from energy frameworks |
Authors of publication | Jha, Kunal Kumar; Dutta, Sanjay; Kumar, Vijay; Munshi, Parthapratim |
Journal of publication | CrystEngComm |
Year of publication | 2016 |
Journal volume | 18 |
Journal issue | 43 |
Pages of publication | 8497 |
a | 7.6956 ± 0.0002 Å |
b | 12.3234 ± 0.0004 Å |
c | 15.6647 ± 0.0005 Å |
α | 82.079 ± 0.001° |
β | 86.38 ± 0.001° |
γ | 84.459 ± 0.001° |
Cell volume | 1462.66 ± 0.08 Å3 |
Cell temperature | 100 ± 2 K |
Ambient diffraction temperature | 100 ± 2 K |
Number of distinct elements | 4 |
Space group number | 2 |
Hermann-Mauguin space group symbol | P -1 |
Hall space group symbol | -P 1 |
Residual factor for all reflections | 0.0609 |
Residual factor for significantly intense reflections | 0.0457 |
Weighted residual factors for significantly intense reflections | 0.1047 |
Weighted residual factors for all reflections included in the refinement | 0.1122 |
Goodness-of-fit parameter for all reflections included in the refinement | 1.053 |
Diffraction radiation wavelength | 0.71073 Å |
Diffraction radiation type | MoKα |