Information card for entry 7226764
Formula | C11 H9 Fe0.5 N O2.5 Zn0.5 |
Calculated formula | C11 H9 Fe0.5 N O2.5 Zn0.5 |
Title of publication | Novel 3-D interpenetrated metal‒organometallic networks based on self-assembled Zn(ii)/Cu(ii) from 1,1′-ferrocenedicarboxylic acid and 4,4′-bipyridine |
Authors of publication | Ospina-Castro, María L.; Reiber, Andreas; Jorge, Gilberto; Ávila, Edward E.; Briceño, Alexander |
Journal of publication | CrystEngComm |
Year of publication | 2017 |
Journal volume | 19 |
Journal issue | 5 |
Pages of publication | 758 |
a | 11.7568 ± 0.0009 Å |
b | 15.0687 ± 0.001 Å |
c | 11.1422 ± 0.0007 Å |
α | 90° |
β | 90° |
γ | 90° |
Cell volume | 1973.9 ± 0.2 Å3 |
Cell temperature | 100 ± 2 K |
Ambient diffraction temperature | 100 ± 2 K |
Number of distinct elements | 6 |
Space group number | 52 |
Hermann-Mauguin space group symbol | P n n a |
Hall space group symbol | -P 2a 2bc |
Residual factor for all reflections | 0.031 |
Residual factor for significantly intense reflections | 0.0277 |
Weighted residual factors for significantly intense reflections | 0.0785 |
Weighted residual factors for all reflections included in the refinement | 0.081 |
Goodness-of-fit parameter for all reflections included in the refinement | 1.061 |
Diffraction radiation wavelength | 1.54184 Å |
Diffraction radiation type | CuKα |