Information card for entry 7227349
Formula | C22 H18 Ag Cl N4 O6 |
Calculated formula | C22 H18 Ag Cl N4 O6 |
Title of publication | Crystal structure analysis of supramolecular arrangements in bis(1-isoquinolinecarboxamide)alkanes and their Ag(i) complexes |
Authors of publication | Parra, Nicole; Belmar, Julio B.; Jiménez, Claudio A.; Pasán, Jorge; Ruiz-Pérez, Catalina |
Journal of publication | CrystEngComm |
Year of publication | 2017 |
Journal volume | 19 |
Journal issue | 7 |
Pages of publication | 1076 |
a | 7.7056 ± 0.0002 Å |
b | 14.8087 ± 0.0003 Å |
c | 21.2528 ± 0.0006 Å |
α | 90° |
β | 117.472 ± 0.004° |
γ | 90° |
Cell volume | 2151.69 ± 0.12 Å3 |
Cell temperature | 293 ± 2 K |
Ambient diffraction temperature | 293 ± 2 K |
Number of distinct elements | 6 |
Space group number | 14 |
Hermann-Mauguin space group symbol | P 1 21/c 1 |
Hall space group symbol | -P 2ybc |
Residual factor for all reflections | 0.0355 |
Residual factor for significantly intense reflections | 0.0276 |
Weighted residual factors for significantly intense reflections | 0.067 |
Weighted residual factors for all reflections included in the refinement | 0.071 |
Goodness-of-fit parameter for all reflections included in the refinement | 1.03 |
Diffraction radiation wavelength | 1.54184 Å |
Diffraction radiation type | CuKα |