Information card for entry 7227350
Formula | C26 H26 Ag Cl N4 O6 |
Calculated formula | C26 H26 Ag Cl N4 O6 |
Title of publication | Crystal structure analysis of supramolecular arrangements in bis(1-isoquinolinecarboxamide)alkanes and their Ag(i) complexes |
Authors of publication | Parra, Nicole; Belmar, Julio B.; Jiménez, Claudio A.; Pasán, Jorge; Ruiz-Pérez, Catalina |
Journal of publication | CrystEngComm |
Year of publication | 2017 |
Journal volume | 19 |
Journal issue | 7 |
Pages of publication | 1076 |
a | 22.6498 ± 0.0007 Å |
b | 9.4681 ± 0.0003 Å |
c | 13.4041 ± 0.0003 Å |
α | 90° |
β | 92.921 ± 0.003° |
γ | 90° |
Cell volume | 2870.78 ± 0.14 Å3 |
Cell temperature | 293 ± 2 K |
Ambient diffraction temperature | 293 ± 2 K |
Number of distinct elements | 6 |
Space group number | 5 |
Hermann-Mauguin space group symbol | C 1 2 1 |
Hall space group symbol | C 2y |
Residual factor for all reflections | 0.0539 |
Residual factor for significantly intense reflections | 0.0522 |
Weighted residual factors for significantly intense reflections | 0.1434 |
Weighted residual factors for all reflections included in the refinement | 0.1468 |
Goodness-of-fit parameter for all reflections included in the refinement | 1.072 |
Diffraction radiation wavelength | 1.54184 Å |
Diffraction radiation type | CuKα |