Information card for entry 7227725
Formula | C24 H14 Co N4 O8 |
Calculated formula | C24 H14 Co N4 O8 |
Title of publication | N-donor auxiliary ligand-directed assembly of CoII compounds with a 2,2′-dinitro-biphenyl-4,4′-dicarboxylate ligand: structures and magnetic properties |
Authors of publication | Zhang, Jian-Yong; Shi, Jun-Xia; Chen, Liang-Yan; Jia, Qin-Xiang; Deng, Wei; Gao, En-Qing |
Journal of publication | CrystEngComm |
Year of publication | 2017 |
Journal volume | 19 |
Journal issue | 13 |
Pages of publication | 1738 |
a | 13.6157 ± 0.0013 Å |
b | 19.5109 ± 0.0019 Å |
c | 8.7982 ± 0.0009 Å |
α | 90° |
β | 96.577 ± 0.001° |
γ | 90° |
Cell volume | 2321.9 ± 0.4 Å3 |
Cell temperature | 293 ± 2 K |
Ambient diffraction temperature | 293 ± 2 K |
Number of distinct elements | 5 |
Space group number | 15 |
Hermann-Mauguin space group symbol | C 1 2/c 1 |
Hall space group symbol | -C 2yc |
Residual factor for all reflections | 0.0333 |
Residual factor for significantly intense reflections | 0.03 |
Weighted residual factors for significantly intense reflections | 0.0797 |
Weighted residual factors for all reflections included in the refinement | 0.0821 |
Goodness-of-fit parameter for all reflections included in the refinement | 1.035 |
Diffraction radiation wavelength | 0.71073 Å |
Diffraction radiation type | MoKα |