Information card for entry 7227724
Formula | C82 H60 Co5 N12 O38 |
Calculated formula | C82 H58 Co5 N12 O38 |
Title of publication | N-donor auxiliary ligand-directed assembly of CoII compounds with a 2,2′-dinitro-biphenyl-4,4′-dicarboxylate ligand: structures and magnetic properties |
Authors of publication | Zhang, Jian-Yong; Shi, Jun-Xia; Chen, Liang-Yan; Jia, Qin-Xiang; Deng, Wei; Gao, En-Qing |
Journal of publication | CrystEngComm |
Year of publication | 2017 |
Journal volume | 19 |
Journal issue | 13 |
Pages of publication | 1738 |
a | 31.687 ± 0.002 Å |
b | 10.9573 ± 0.0005 Å |
c | 27.1488 ± 0.0015 Å |
α | 90° |
β | 115.982 ± 0.006° |
γ | 90° |
Cell volume | 8473.5 ± 0.9 Å3 |
Cell temperature | 153 ± 2 K |
Ambient diffraction temperature | 153 ± 2 K |
Number of distinct elements | 5 |
Space group number | 15 |
Hermann-Mauguin space group symbol | C 1 2/c 1 |
Hall space group symbol | -C 2yc |
Residual factor for all reflections | 0.1172 |
Residual factor for significantly intense reflections | 0.0644 |
Weighted residual factors for significantly intense reflections | 0.1332 |
Weighted residual factors for all reflections included in the refinement | 0.165 |
Goodness-of-fit parameter for all reflections included in the refinement | 0.987 |
Diffraction radiation wavelength | 0.71073 Å |
Diffraction radiation type | MoKα |