Information card for entry 7233478
Common name | Eu5Zn2C140H135O47N40 |
Formula | C140 H135 Eu5 N40 O47 Zn2 |
Calculated formula | C140 H135 Eu5 N40 O47 Zn2 |
Title of publication | Eu3±doped Tb3+ metal-organic frameworks emitting tunable three primary colors towards white light |
Authors of publication | Zhi-Fa Liu; Mei-Feng Wu; Shuai-Hua Wang; Fa-Kun Zheng; Guan-E. Wang; Jun Chen; Yu Xiao; A-Qing Wu; Guo-Cong Guo; Jin-Shun Huang |
Journal of publication | Journal of Materials Chemistry C |
Year of publication | 2013 |
Journal volume | 1 |
Pages of publication | 4634 - 4639 |
a | 13.094 ± 0.003 Å |
b | 14.061 ± 0.003 Å |
c | 23.454 ± 0.005 Å |
α | 94.235 ± 0.001° |
β | 97.134 ± 0.003° |
γ | 113.48 ± 0.003° |
Cell volume | 3893.8 ± 1.5 Å3 |
Cell temperature | 293 ± 2 K |
Ambient diffraction temperature | 293 ± 2 K |
Number of distinct elements | 6 |
Space group number | 2 |
Hermann-Mauguin space group symbol | P -1 |
Hall space group symbol | -P 1 |
Residual factor for all reflections | 0.0526 |
Residual factor for significantly intense reflections | 0.0436 |
Weighted residual factors for significantly intense reflections | 0.1194 |
Weighted residual factors for all reflections included in the refinement | 0.1283 |
Goodness-of-fit parameter for all reflections included in the refinement | 1.038 |
Diffraction radiation wavelength | 0.71073 Å |
Diffraction radiation type | MoKα |