Information card for entry 7233479
Common name | C140H135N40O47Tb5Zn2 |
Formula | C140 H135 N40 O47 Tb5 Zn2 |
Calculated formula | C140 H135 N40 O47 Tb5 Zn2 |
Title of publication | Eu3±doped Tb3+ metal-organic frameworks emitting tunable three primary colors towards white light |
Authors of publication | Zhi-Fa Liu; Mei-Feng Wu; Shuai-Hua Wang; Fa-Kun Zheng; Guan-E. Wang; Jun Chen; Yu Xiao; A-Qing Wu; Guo-Cong Guo; Jin-Shun Huang |
Journal of publication | Journal of Materials Chemistry C |
Year of publication | 2013 |
Journal volume | 1 |
Pages of publication | 4634 - 4639 |
a | 12.973 ± 0.003 Å |
b | 14.046 ± 0.005 Å |
c | 23.376 ± 0.006 Å |
α | 94.335 ± 0.012° |
β | 96.686 ± 0.009° |
γ | 113.976 ± 0.005° |
Cell volume | 3829.9 ± 1.9 Å3 |
Cell temperature | 293 ± 2 K |
Ambient diffraction temperature | 293 ± 2 K |
Number of distinct elements | 6 |
Space group number | 2 |
Hermann-Mauguin space group symbol | P -1 |
Hall space group symbol | -P 1 |
Residual factor for all reflections | 0.09 |
Residual factor for significantly intense reflections | 0.0756 |
Weighted residual factors for significantly intense reflections | 0.1786 |
Weighted residual factors for all reflections included in the refinement | 0.1905 |
Goodness-of-fit parameter for all reflections included in the refinement | 0.995 |
Diffraction radiation wavelength | 0.71073 Å |
Diffraction radiation type | MoKα |