Information card for entry 7233511
Formula | C34 H46 Cl2 N2 Si2 |
Calculated formula | C34 H46 Cl2 N2 Si2 |
Title of publication | N-Fused quinoxalines and benzoquinoxalines as attractive emitters for organic light emitting diodes |
Authors of publication | Benjamin D. Lindner; Yexiang Zhang; Stefan Hofle; Nancy Berger; Claudia Teusch; Malte Jesper; Kenneth I. Hardcastle; Xuhong Qian; Uli Lemmer; Alexander Colsmann; Uwe H. F. Bunz; Manuel Hamburger |
Journal of publication | Journal of Materials Chemistry C |
Year of publication | 2013 |
Journal volume | 1 |
Pages of publication | 5718 - 5724 |
a | 14.5958 ± 0.0011 Å |
b | 14.9387 ± 0.001 Å |
c | 16.2175 ± 0.0011 Å |
α | 90° |
β | 98.656 ± 0.002° |
γ | 90° |
Cell volume | 3495.8 ± 0.4 Å3 |
Cell temperature | 200 ± 2 K |
Ambient diffraction temperature | 200 ± 2 K |
Number of distinct elements | 5 |
Space group number | 14 |
Hermann-Mauguin space group symbol | P 1 21/c 1 |
Hall space group symbol | -P 2ybc |
Residual factor for all reflections | 0.1088 |
Residual factor for significantly intense reflections | 0.0518 |
Weighted residual factors for significantly intense reflections | 0.1057 |
Weighted residual factors for all reflections included in the refinement | 0.1273 |
Goodness-of-fit parameter for all reflections included in the refinement | 0.997 |
Diffraction radiation wavelength | 0.71073 Å |
Diffraction radiation type | MoKα |