Information card for entry 7233512
Formula | C46 H54 N2 Si2 |
Calculated formula | C46 H54 N2 Si2 |
Title of publication | N-Fused quinoxalines and benzoquinoxalines as attractive emitters for organic light emitting diodes |
Authors of publication | Benjamin D. Lindner; Yexiang Zhang; Stefan Hofle; Nancy Berger; Claudia Teusch; Malte Jesper; Kenneth I. Hardcastle; Xuhong Qian; Uli Lemmer; Alexander Colsmann; Uwe H. F. Bunz; Manuel Hamburger |
Journal of publication | Journal of Materials Chemistry C |
Year of publication | 2013 |
Journal volume | 1 |
Pages of publication | 5718 - 5724 |
a | 14.8061 ± 0.001 Å |
b | 16.0206 ± 0.0011 Å |
c | 17.5296 ± 0.0011 Å |
α | 97.524 ± 0.004° |
β | 98.064 ± 0.004° |
γ | 90.635 ± 0.004° |
Cell volume | 4079.7 ± 0.5 Å3 |
Cell temperature | 293 ± 2 K |
Ambient diffraction temperature | 293 ± 2 K |
Number of distinct elements | 4 |
Space group number | 2 |
Hermann-Mauguin space group symbol | P -1 |
Hall space group symbol | -P 1 |
Residual factor for all reflections | 0.1516 |
Residual factor for significantly intense reflections | 0.0762 |
Weighted residual factors for significantly intense reflections | 0.1721 |
Weighted residual factors for all reflections included in the refinement | 0.208 |
Goodness-of-fit parameter for all reflections included in the refinement | 1.042 |
Diffraction radiation wavelength | 1.54178 Å |
Diffraction radiation type | CuKα |