Information card for entry 7233513
Formula | C54 H74 N2 Si2 |
Calculated formula | C54 H74 N2 Si2 |
Title of publication | N-Fused quinoxalines and benzoquinoxalines as attractive emitters for organic light emitting diodes |
Authors of publication | Benjamin D. Lindner; Yexiang Zhang; Stefan Hofle; Nancy Berger; Claudia Teusch; Malte Jesper; Kenneth I. Hardcastle; Xuhong Qian; Uli Lemmer; Alexander Colsmann; Uwe H. F. Bunz; Manuel Hamburger |
Journal of publication | Journal of Materials Chemistry C |
Year of publication | 2013 |
Journal volume | 1 |
Pages of publication | 5718 - 5724 |
a | 11.1333 ± 0.0012 Å |
b | 13.6022 ± 0.0015 Å |
c | 17.6452 ± 0.0019 Å |
α | 80.944 ± 0.002° |
β | 81.277 ± 0.002° |
γ | 72.615 ± 0.002° |
Cell volume | 2502.7 ± 0.5 Å3 |
Cell temperature | 173 ± 2 K |
Ambient diffraction temperature | 173 ± 2 K |
Number of distinct elements | 4 |
Space group number | 2 |
Hermann-Mauguin space group symbol | P -1 |
Hall space group symbol | -P 1 |
Residual factor for all reflections | 0.1222 |
Residual factor for significantly intense reflections | 0.0652 |
Weighted residual factors for significantly intense reflections | 0.1716 |
Weighted residual factors for all reflections included in the refinement | 0.2064 |
Goodness-of-fit parameter for all reflections included in the refinement | 1.069 |
Diffraction radiation wavelength | 0.71073 Å |
Diffraction radiation type | MoKα |