Information card for entry 7234794
Formula | C12 H14 Br4 O6 S2 |
Calculated formula | C12 H14 Br4 O6 S2 |
Title of publication | Two-dimensional halogen-bonded organic frameworks based on the tetrabromobenzene-1,4-dicarboxylic acid building molecule |
Authors of publication | Chongboriboon, Nucharee; Samakun, Kodchakorn; Inprasit, Thitirat; Kielar, Filip; Dungkaew, Winya; Wong, Lawrence W.-Y.; Sung, Herman H.-Y.; Ninković, Dragan B.; Zarić, Snežana D.; Chainok, Kittipong |
Journal of publication | CrystEngComm |
Year of publication | 2020 |
Journal volume | 22 |
Journal issue | 1 |
Pages of publication | 24 - 34 |
a | 9.24933 ± 0.00017 Å |
b | 25.7601 ± 0.0006 Å |
c | 8.66218 ± 0.00018 Å |
α | 90° |
β | 90° |
γ | 90° |
Cell volume | 2063.88 ± 0.07 Å3 |
Cell temperature | 100 ± 2 K |
Ambient diffraction temperature | 100 ± 2 K |
Number of distinct elements | 5 |
Space group number | 62 |
Hermann-Mauguin space group symbol | P n m a |
Hall space group symbol | -P 2ac 2n |
Residual factor for all reflections | 0.0467 |
Residual factor for significantly intense reflections | 0.0453 |
Weighted residual factors for significantly intense reflections | 0.1087 |
Weighted residual factors for all reflections included in the refinement | 0.1093 |
Goodness-of-fit parameter for all reflections included in the refinement | 1.121 |
Diffraction radiation wavelength | 1.54184 Å |
Diffraction radiation type | CuKα |