Information card for entry 7234795
Formula | C12 H14 Br4 O6 |
Calculated formula | C12 H14 Br4 O6 |
Title of publication | Two-dimensional halogen-bonded organic frameworks based on the tetrabromobenzene-1,4-dicarboxylic acid building molecule |
Authors of publication | Chongboriboon, Nucharee; Samakun, Kodchakorn; Inprasit, Thitirat; Kielar, Filip; Dungkaew, Winya; Wong, Lawrence W.-Y.; Sung, Herman H.-Y.; Ninković, Dragan B.; Zarić, Snežana D.; Chainok, Kittipong |
Journal of publication | CrystEngComm |
Year of publication | 2020 |
Journal volume | 22 |
Journal issue | 1 |
Pages of publication | 24 - 34 |
a | 9.1624 ± 0.0005 Å |
b | 23.482 ± 0.0012 Å |
c | 8.993 ± 0.0004 Å |
α | 90° |
β | 90° |
γ | 90° |
Cell volume | 1934.86 ± 0.17 Å3 |
Cell temperature | 296 K |
Ambient diffraction temperature | 296 K |
Number of distinct elements | 4 |
Space group number | 62 |
Hermann-Mauguin space group symbol | P n m a |
Hall space group symbol | -P 2ac 2n |
Residual factor for all reflections | 0.0344 |
Residual factor for significantly intense reflections | 0.0275 |
Weighted residual factors for significantly intense reflections | 0.0688 |
Weighted residual factors for all reflections included in the refinement | 0.073 |
Goodness-of-fit parameter for all reflections included in the refinement | 1.037 |
Diffraction radiation probe | x-ray |
Diffraction radiation wavelength | 0.71073 Å |
Diffraction radiation type | MoKα |