Information card for entry 7234844
Formula | C24 H18 Ag F3 N4 O4 |
Calculated formula | C24 H18 Ag F3 N4 O4 |
Title of publication | Influence of counterions on the supramolecular frameworks of isoquinoline-based silver(i) complexes |
Authors of publication | Parra-Muñoz, Nicole; Hidalgo, Paulina I.; Ripoll, Gerardo; Belmar, Julio; Pasán, Jorge; Jiménez, Claudio A. |
Journal of publication | CrystEngComm |
Year of publication | 2020 |
Journal volume | 22 |
Journal issue | 1 |
Pages of publication | 95 - 104 |
a | 22.6683 ± 0.0006 Å |
b | 11.9842 ± 0.0002 Å |
c | 17.9923 ± 0.0005 Å |
α | 90° |
β | 111.403 ± 0.003° |
γ | 90° |
Cell volume | 4550.7 ± 0.2 Å3 |
Cell temperature | 293 ± 2 K |
Ambient diffraction temperature | 293 ± 2 K |
Number of distinct elements | 6 |
Space group number | 15 |
Hermann-Mauguin space group symbol | C 1 2/c 1 |
Hall space group symbol | -C 2yc |
Residual factor for all reflections | 0.0253 |
Residual factor for significantly intense reflections | 0.0238 |
Weighted residual factors for significantly intense reflections | 0.0624 |
Weighted residual factors for all reflections included in the refinement | 0.0638 |
Goodness-of-fit parameter for all reflections included in the refinement | 1.032 |
Diffraction radiation probe | x-ray |
Diffraction radiation wavelength | 1.54184 Å |
Diffraction radiation type | CuKα |