Information card for entry 7234845
Formula | C24 H22 Ag N5 O5 |
Calculated formula | C24 H22 Ag N5 O5 |
Title of publication | Influence of counterions on the supramolecular frameworks of isoquinoline-based silver(i) complexes |
Authors of publication | Parra-Muñoz, Nicole; Hidalgo, Paulina I.; Ripoll, Gerardo; Belmar, Julio; Pasán, Jorge; Jiménez, Claudio A. |
Journal of publication | CrystEngComm |
Year of publication | 2020 |
Journal volume | 22 |
Journal issue | 1 |
Pages of publication | 95 - 104 |
a | 7.2584 ± 0.0002 Å |
b | 14.4126 ± 0.0003 Å |
c | 21.3749 ± 0.0005 Å |
α | 90° |
β | 91.472 ± 0.002° |
γ | 90° |
Cell volume | 2235.34 ± 0.09 Å3 |
Cell temperature | 293 ± 2 K |
Ambient diffraction temperature | 293 ± 2 K |
Number of distinct elements | 5 |
Space group number | 14 |
Hermann-Mauguin space group symbol | P 1 21/n 1 |
Hall space group symbol | -P 2yn |
Residual factor for all reflections | 0.0385 |
Residual factor for significantly intense reflections | 0.0312 |
Weighted residual factors for significantly intense reflections | 0.0766 |
Weighted residual factors for all reflections included in the refinement | 0.0806 |
Goodness-of-fit parameter for all reflections included in the refinement | 1.033 |
Diffraction radiation probe | x-ray |
Diffraction radiation wavelength | 1.54184 Å |
Diffraction radiation type | CuKα |