Information card for entry 7234847
Formula | C23 H22 Ag N5 O6 |
Calculated formula | C23 H22 Ag N5 O6 |
Title of publication | Influence of counterions on the supramolecular frameworks of isoquinoline-based silver(i) complexes |
Authors of publication | Parra-Muñoz, Nicole; Hidalgo, Paulina I.; Ripoll, Gerardo; Belmar, Julio; Pasán, Jorge; Jiménez, Claudio A. |
Journal of publication | CrystEngComm |
Year of publication | 2020 |
Journal volume | 22 |
Journal issue | 1 |
Pages of publication | 95 - 104 |
a | 7.3244 ± 0.0006 Å |
b | 8.2198 ± 0.0007 Å |
c | 19.557 ± 0.001 Å |
α | 87.931 ± 0.005° |
β | 86.794 ± 0.006° |
γ | 88.681 ± 0.007° |
Cell volume | 1174.56 ± 0.15 Å3 |
Cell temperature | 293 ± 2 K |
Ambient diffraction temperature | 293 ± 2 K |
Number of distinct elements | 5 |
Space group number | 2 |
Hermann-Mauguin space group symbol | P -1 |
Hall space group symbol | -P 1 |
Residual factor for all reflections | 0.0784 |
Residual factor for significantly intense reflections | 0.0629 |
Weighted residual factors for significantly intense reflections | 0.1642 |
Weighted residual factors for all reflections included in the refinement | 0.1824 |
Goodness-of-fit parameter for all reflections included in the refinement | 1.043 |
Diffraction radiation wavelength | 1.5418 Å |
Diffraction radiation type | CuKα |