Information card for entry 7234848
Formula | C26 H30 Ag F3 N4 O8 |
Calculated formula | C26 H30 Ag F3 N4 O8 |
Title of publication | Influence of counterions on the supramolecular frameworks of isoquinoline-based silver(i) complexes |
Authors of publication | Parra-Muñoz, Nicole; Hidalgo, Paulina I.; Ripoll, Gerardo; Belmar, Julio; Pasán, Jorge; Jiménez, Claudio A. |
Journal of publication | CrystEngComm |
Year of publication | 2020 |
Journal volume | 22 |
Journal issue | 1 |
Pages of publication | 95 - 104 |
a | 8.7388 ± 0.0003 Å |
b | 11.7437 ± 0.0004 Å |
c | 15.173 ± 0.0004 Å |
α | 89.58 ± 0.003° |
β | 74.494 ± 0.003° |
γ | 80.378 ± 0.003° |
Cell volume | 1478.21 ± 0.09 Å3 |
Cell temperature | 293 ± 2 K |
Ambient diffraction temperature | 293 ± 2 K |
Number of distinct elements | 6 |
Space group number | 2 |
Hermann-Mauguin space group symbol | P -1 |
Hall space group symbol | -P 1 |
Residual factor for all reflections | 0.0604 |
Residual factor for significantly intense reflections | 0.0486 |
Weighted residual factors for significantly intense reflections | 0.1386 |
Weighted residual factors for all reflections included in the refinement | 0.1495 |
Goodness-of-fit parameter for all reflections included in the refinement | 1.052 |
Diffraction radiation probe | x-ray |
Diffraction radiation wavelength | 1.54184 Å |
Diffraction radiation type | CuKα |