Information card for entry 7234849
Formula | C320 H460 Gd6 N24 Na2 O218 S32 |
Calculated formula | C320 H280 Gd6 N24 Na2 O218 S32 |
Title of publication | Influence of ortho- and meta-substituted N-heterocyclic dications towards the self-assembly of p-sulfonatocalix[4]arene |
Authors of publication | Loh, Sze Le; Sobolev, Alexandre N.; Lim, Siew Huah; Ling, Irene |
Journal of publication | CrystEngComm |
Year of publication | 2020 |
Journal volume | 22 |
Journal issue | 1 |
Pages of publication | 52 - 60 |
a | 17.657 ± 0.0005 Å |
b | 21.7188 ± 0.0005 Å |
c | 27.9006 ± 0.0005 Å |
α | 97.688 ± 0.002° |
β | 100.408 ± 0.002° |
γ | 98.551 ± 0.002° |
Cell volume | 10263.6 ± 0.4 Å3 |
Cell temperature | 100 ± 2 K |
Ambient diffraction temperature | 100 ± 2 K |
Number of distinct elements | 7 |
Space group number | 2 |
Hermann-Mauguin space group symbol | P -1 |
Hall space group symbol | -P 1 |
Residual factor for all reflections | 0.1263 |
Residual factor for significantly intense reflections | 0.1047 |
Weighted residual factors for significantly intense reflections | 0.241 |
Weighted residual factors for all reflections included in the refinement | 0.2561 |
Goodness-of-fit parameter for all reflections included in the refinement | 1.401 |
Diffraction radiation wavelength | 1.54178 Å |
Diffraction radiation type | CuKα |