Information card for entry 7235220
Formula | C80 H78 O14 |
Calculated formula | C80 H78 O14 |
Title of publication | Co-crystals of 9,9′-bianthracene-10,10′-dicarboxylic acid with linear bidentate basic ligand molecules: synthesis, crystal structure, and properties based on the layer structure exfoliated by water |
Authors of publication | Okayasu, Misaki; Kikkawa, Shoko; Hikawa, Hidemasa; Azumaya, Isao |
Journal of publication | CrystEngComm |
Year of publication | 2020 |
Journal volume | 22 |
Journal issue | 3 |
Pages of publication | 497 - 505 |
a | 9.18848 ± 0.00015 Å |
b | 18.3718 ± 0.0002 Å |
c | 19.6091 ± 0.00018 Å |
α | 98.7879 ± 0.0009° |
β | 92.6442 ± 0.001° |
γ | 97.7172 ± 0.0013° |
Cell volume | 3234.19 ± 0.07 Å3 |
Cell temperature | 93 K |
Ambient diffraction temperature | 93 K |
Number of distinct elements | 3 |
Space group number | 2 |
Hermann-Mauguin space group symbol | P -1 |
Hall space group symbol | -P 1 |
Residual factor for all reflections | 0.0872 |
Residual factor for significantly intense reflections | 0.0802 |
Weighted residual factors for significantly intense reflections | 0.2322 |
Weighted residual factors for all reflections included in the refinement | 0.2417 |
Goodness-of-fit parameter for all reflections included in the refinement | 1.029 |
Diffraction radiation wavelength | 1.54187 Å |
Diffraction radiation type | CuKα |