Information card for entry 7235221
Formula | C28 H17 N O2 |
Calculated formula | C28 H17 N O2 |
Title of publication | Co-crystals of 9,9′-bianthracene-10,10′-dicarboxylic acid with linear bidentate basic ligand molecules: synthesis, crystal structure, and properties based on the layer structure exfoliated by water |
Authors of publication | Okayasu, Misaki; Kikkawa, Shoko; Hikawa, Hidemasa; Azumaya, Isao |
Journal of publication | CrystEngComm |
Year of publication | 2020 |
Journal volume | 22 |
Journal issue | 3 |
Pages of publication | 497 - 505 |
a | 11.97202 ± 0.00019 Å |
b | 12.277 ± 0.00018 Å |
c | 12.64035 ± 0.00017 Å |
α | 90° |
β | 90° |
γ | 90° |
Cell volume | 1857.88 ± 0.05 Å3 |
Cell temperature | 93 K |
Ambient diffraction temperature | 93 K |
Number of distinct elements | 4 |
Space group number | 60 |
Hermann-Mauguin space group symbol | P b c n |
Hall space group symbol | -P 2n 2ab |
Residual factor for all reflections | 0.048 |
Residual factor for significantly intense reflections | 0.0453 |
Weighted residual factors for significantly intense reflections | 0.127 |
Weighted residual factors for all reflections included in the refinement | 0.1307 |
Goodness-of-fit parameter for all reflections included in the refinement | 1.05 |
Diffraction radiation wavelength | 1.54184 Å |
Diffraction radiation type | CuKα |