Information card for entry 7235976
Formula | C24 H26 B2 F4 N4 |
Calculated formula | C24 H26 B2 F4 N4 |
Title of publication | Unusual spectroscopic and photophysical properties of meso-tert-butylBODIPY in comparison to related alkylated BODIPY dyes |
Authors of publication | Jiao, Lijuan; Yu, Changjiang; Wang, Jun; Briggs, Edward A.; Besley, Nicholas A.; Robinson, David; Ruedas-Rama, María J.; Orte, Angel; Crovetto, Luis; Talavera, Eva M.; Alvarez-Pez, Jose M.; Van der Auweraer, Mark; Boens, Noël |
Journal of publication | RSC Advances |
Year of publication | 2015 |
Journal volume | 5 |
Journal issue | 109 |
Pages of publication | 89375 |
a | 16.054 ± 0.002 Å |
b | 12.6204 ± 0.0019 Å |
c | 13.685 ± 0.003 Å |
α | 90° |
β | 120.228 ± 0.001° |
γ | 90° |
Cell volume | 2395.7 ± 0.7 Å3 |
Cell temperature | 293 ± 2 K |
Ambient diffraction temperature | 293.15 K |
Number of distinct elements | 5 |
Space group number | 9 |
Hermann-Mauguin space group symbol | C 1 c 1 |
Hall space group symbol | C -2yc |
Residual factor for all reflections | 0.0558 |
Residual factor for significantly intense reflections | 0.0373 |
Weighted residual factors for significantly intense reflections | 0.0872 |
Weighted residual factors for all reflections included in the refinement | 0.0987 |
Goodness-of-fit parameter for all reflections included in the refinement | 1.01 |
Diffraction radiation wavelength | 0.71 Å |
Diffraction radiation type | MoKα |