Information card for entry 7235977
Formula | C13 H15 B F2 N2 |
Calculated formula | C13 H15 B F2 N2 |
Title of publication | Unusual spectroscopic and photophysical properties of meso-tert-butylBODIPY in comparison to related alkylated BODIPY dyes |
Authors of publication | Jiao, Lijuan; Yu, Changjiang; Wang, Jun; Briggs, Edward A.; Besley, Nicholas A.; Robinson, David; Ruedas-Rama, María J.; Orte, Angel; Crovetto, Luis; Talavera, Eva M.; Alvarez-Pez, Jose M.; Van der Auweraer, Mark; Boens, Noël |
Journal of publication | RSC Advances |
Year of publication | 2015 |
Journal volume | 5 |
Journal issue | 109 |
Pages of publication | 89375 |
a | 14.254 ± 0.002 Å |
b | 13.5629 ± 0.0019 Å |
c | 6.4554 ± 0.0009 Å |
α | 90° |
β | 90° |
γ | 90° |
Cell volume | 1248 ± 0.3 Å3 |
Cell temperature | 293 ± 2 K |
Ambient diffraction temperature | 293 ± 2 K |
Number of distinct elements | 5 |
Space group number | 33 |
Hermann-Mauguin space group symbol | P n a 21 |
Hall space group symbol | P 2c -2n |
Residual factor for all reflections | 0.1318 |
Residual factor for significantly intense reflections | 0.0764 |
Weighted residual factors for significantly intense reflections | 0.2216 |
Weighted residual factors for all reflections included in the refinement | 0.2688 |
Goodness-of-fit parameter for all reflections included in the refinement | 1.037 |
Diffraction radiation wavelength | 0.71073 Å |
Diffraction radiation type | MoKα |