Information card for entry 7235990
Formula | C56.25 H94 Al4 N2 O5 Si |
Calculated formula | C56.25 H94 Al4 N2 O5 Si |
Title of publication | Homo- and heteroalumoxane silicates |
Authors of publication | García-Ríos, Jessica; Hernández-Campos, René Francisco; Rascón-Cruz, Fernando; Moreno-Martínez, Víctor Augusto; Huerta-Lavorie, Raúl; Velázquez-Carmona, Miguel-Ángel; Cea-Olivares, Raymundo; Martínez-Otero, Diego; Jancik, Vojtech |
Journal of publication | RSC Advances |
Year of publication | 2015 |
Journal volume | 5 |
Journal issue | 121 |
Pages of publication | 99722 |
a | 22.0822 ± 0.0003 Å |
b | 11.9421 ± 0.0001 Å |
c | 46.3436 ± 0.0006 Å |
α | 90° |
β | 103.718 ± 0.001° |
γ | 90° |
Cell volume | 11872.6 ± 0.2 Å3 |
Cell temperature | 100 ± 2 K |
Ambient diffraction temperature | 100 ± 2 K |
Number of distinct elements | 6 |
Space group number | 14 |
Hermann-Mauguin space group symbol | P 1 21/n 1 |
Hall space group symbol | -P 2yn |
Residual factor for all reflections | 0.0493 |
Residual factor for significantly intense reflections | 0.0419 |
Weighted residual factors for significantly intense reflections | 0.1084 |
Weighted residual factors for all reflections included in the refinement | 0.1137 |
Goodness-of-fit parameter for all reflections included in the refinement | 1.026 |
Diffraction radiation wavelength | 1.54178 Å |
Diffraction radiation type | CuKα |