Information card for entry 7235991
Formula | C39 H66 Al Ga N2 O5 Si |
Calculated formula | C39 H66 Al Ga N2 O5 Si |
Title of publication | Homo- and heteroalumoxane silicates |
Authors of publication | García-Ríos, Jessica; Hernández-Campos, René Francisco; Rascón-Cruz, Fernando; Moreno-Martínez, Víctor Augusto; Huerta-Lavorie, Raúl; Velázquez-Carmona, Miguel-Ángel; Cea-Olivares, Raymundo; Martínez-Otero, Diego; Jancik, Vojtech |
Journal of publication | RSC Advances |
Year of publication | 2015 |
Journal volume | 5 |
Journal issue | 121 |
Pages of publication | 99722 |
a | 10.899 ± 0.002 Å |
b | 12.289 ± 0.003 Å |
c | 19.083 ± 0.003 Å |
α | 71.71 ± 0.03° |
β | 88.35 ± 0.03° |
γ | 63.76 ± 0.02° |
Cell volume | 2158.5 ± 1 Å3 |
Cell temperature | 173 ± 2 K |
Ambient diffraction temperature | 173 ± 2 K |
Number of distinct elements | 7 |
Space group number | 2 |
Hermann-Mauguin space group symbol | P -1 |
Hall space group symbol | -P 1 |
Residual factor for all reflections | 0.0722 |
Residual factor for significantly intense reflections | 0.0503 |
Weighted residual factors for significantly intense reflections | 0.1102 |
Weighted residual factors for all reflections included in the refinement | 0.12 |
Goodness-of-fit parameter for all reflections included in the refinement | 1.014 |
Diffraction radiation wavelength | 0.71073 Å |
Diffraction radiation type | MoKα |