Information card for entry 7235993
Formula | C79.36 H130.72 Al2 N4 O10.84 Si2 Zn3 |
Calculated formula | C79.36 H130.72 Al2 N4 O10.84 Si2 Zn3 |
Title of publication | Homo- and heteroalumoxane silicates |
Authors of publication | García-Ríos, Jessica; Hernández-Campos, René Francisco; Rascón-Cruz, Fernando; Moreno-Martínez, Víctor Augusto; Huerta-Lavorie, Raúl; Velázquez-Carmona, Miguel-Ángel; Cea-Olivares, Raymundo; Martínez-Otero, Diego; Jancik, Vojtech |
Journal of publication | RSC Advances |
Year of publication | 2015 |
Journal volume | 5 |
Journal issue | 121 |
Pages of publication | 99722 |
a | 12.348 ± 0.001 Å |
b | 22.49 ± 0.002 Å |
c | 16.843 ± 0.002 Å |
α | 90° |
β | 110.51 ± 0.02° |
γ | 90° |
Cell volume | 4380.9 ± 0.9 Å3 |
Cell temperature | 173 ± 2 K |
Ambient diffraction temperature | 173 ± 2 K |
Number of distinct elements | 7 |
Space group number | 4 |
Hermann-Mauguin space group symbol | P 1 21 1 |
Hall space group symbol | P 2yb |
Residual factor for all reflections | 0.0619 |
Residual factor for significantly intense reflections | 0.0456 |
Weighted residual factors for significantly intense reflections | 0.0924 |
Weighted residual factors for all reflections included in the refinement | 0.0992 |
Goodness-of-fit parameter for all reflections included in the refinement | 0.993 |
Diffraction radiation wavelength | 0.71073 Å |
Diffraction radiation type | MoKα |