Information card for entry 7235992
Formula | C44.5 H75 Al Ga2 N2 O5 Si |
Calculated formula | C44.5 H75 Al Ga2 N2 O5 Si |
Title of publication | Homo- and heteroalumoxane silicates |
Authors of publication | García-Ríos, Jessica; Hernández-Campos, René Francisco; Rascón-Cruz, Fernando; Moreno-Martínez, Víctor Augusto; Huerta-Lavorie, Raúl; Velázquez-Carmona, Miguel-Ángel; Cea-Olivares, Raymundo; Martínez-Otero, Diego; Jancik, Vojtech |
Journal of publication | RSC Advances |
Year of publication | 2015 |
Journal volume | 5 |
Journal issue | 121 |
Pages of publication | 99722 |
a | 11.236 ± 0.001 Å |
b | 22.588 ± 0.002 Å |
c | 22.603 ± 0.002 Å |
α | 60.545 ± 0.001° |
β | 83.87 ± 0.001° |
γ | 77.316 ± 0.001° |
Cell volume | 4873.2 ± 0.8 Å3 |
Cell temperature | 100 ± 2 K |
Ambient diffraction temperature | 100 ± 2 K |
Number of distinct elements | 7 |
Space group number | 2 |
Hermann-Mauguin space group symbol | P -1 |
Hall space group symbol | -P 1 |
Residual factor for all reflections | 0.0783 |
Residual factor for significantly intense reflections | 0.0638 |
Weighted residual factors for significantly intense reflections | 0.1671 |
Weighted residual factors for all reflections included in the refinement | 0.1748 |
Goodness-of-fit parameter for all reflections included in the refinement | 1.104 |
Diffraction radiation wavelength | 0.71073 Å |
Diffraction radiation type | MoKα |