Information card for entry 7236000
Formula | C107 H84 B Cu3 F10 N2 O2 P6 |
Calculated formula | C107 H84 B Cu3 F10 N2 O2 P6 |
Title of publication | Assembly of BF4−, PF6−, ClO4− and F− with trinuclear copper(i) acetylide complexes bearing amide groups: structural diversity, photophysics and anion binding properties |
Authors of publication | Shi, Hua-Yun; Huang, Yong-Liang; Sun, Jia-Kai; Jiang, Ji-Jun; Luo, Zhi-Xing; Ling, Hui-Tao; Lam, Chi-Keung; Chao, Hsiu-Yi |
Journal of publication | RSC Advances |
Year of publication | 2015 |
Journal volume | 5 |
Journal issue | 109 |
Pages of publication | 89669 |
a | 29.9632 ± 0.0004 Å |
b | 22.3042 ± 0.0003 Å |
c | 30.6835 ± 0.0004 Å |
α | 90° |
β | 101.174 ± 0.001° |
γ | 90° |
Cell volume | 20117.2 ± 0.5 Å3 |
Cell temperature | 293 ± 2 K |
Ambient diffraction temperature | 293 ± 2 K |
Number of distinct elements | 8 |
Space group number | 15 |
Hermann-Mauguin space group symbol | C 1 2/c 1 |
Hall space group symbol | -C 2yc |
Residual factor for all reflections | 0.0482 |
Residual factor for significantly intense reflections | 0.0412 |
Weighted residual factors for significantly intense reflections | 0.1085 |
Weighted residual factors for all reflections included in the refinement | 0.1133 |
Goodness-of-fit parameter for all reflections included in the refinement | 1.056 |
Diffraction radiation wavelength | 1.54178 Å |
Diffraction radiation type | CuKα |