Information card for entry 7236001
Formula | C420 H343 B4 Cu12 F16 N8 O8 P24 |
Calculated formula | C420 H343 B4 Cu12 F16 N8 O8 P24 |
Title of publication | Assembly of BF4−, PF6−, ClO4− and F− with trinuclear copper(i) acetylide complexes bearing amide groups: structural diversity, photophysics and anion binding properties |
Authors of publication | Shi, Hua-Yun; Huang, Yong-Liang; Sun, Jia-Kai; Jiang, Ji-Jun; Luo, Zhi-Xing; Ling, Hui-Tao; Lam, Chi-Keung; Chao, Hsiu-Yi |
Journal of publication | RSC Advances |
Year of publication | 2015 |
Journal volume | 5 |
Journal issue | 109 |
Pages of publication | 89669 |
a | 27.5828 ± 0.0002 Å |
b | 28.8914 ± 0.0002 Å |
c | 24.54769 ± 0.00019 Å |
α | 90° |
β | 103.705 ± 0.0008° |
γ | 90° |
Cell volume | 19005.2 ± 0.2 Å3 |
Cell temperature | 293 ± 2 K |
Ambient diffraction temperature | 293 ± 2 K |
Number of distinct elements | 8 |
Space group number | 7 |
Hermann-Mauguin space group symbol | P 1 c 1 |
Hall space group symbol | P -2yc |
Residual factor for all reflections | 0.0416 |
Residual factor for significantly intense reflections | 0.0392 |
Weighted residual factors for significantly intense reflections | 0.1005 |
Weighted residual factors for all reflections included in the refinement | 0.1028 |
Goodness-of-fit parameter for all reflections included in the refinement | 1.016 |
Diffraction radiation wavelength | 1.54184 Å |
Diffraction radiation type | CuKα |