Information card for entry 7236003
Formula | C107 H90 Cu3 F N2 O4 P6 |
Calculated formula | C107 H90 Cu3 F N2 O4 P6 |
Title of publication | Assembly of BF4−, PF6−, ClO4− and F− with trinuclear copper(i) acetylide complexes bearing amide groups: structural diversity, photophysics and anion binding properties |
Authors of publication | Shi, Hua-Yun; Huang, Yong-Liang; Sun, Jia-Kai; Jiang, Ji-Jun; Luo, Zhi-Xing; Ling, Hui-Tao; Lam, Chi-Keung; Chao, Hsiu-Yi |
Journal of publication | RSC Advances |
Year of publication | 2015 |
Journal volume | 5 |
Journal issue | 109 |
Pages of publication | 89669 |
a | 17.9069 ± 0.0001 Å |
b | 23.0779 ± 0.0002 Å |
c | 27.5279 ± 0.0003 Å |
α | 90° |
β | 104.656 ± 0.001° |
γ | 90° |
Cell volume | 11005.9 ± 0.17 Å3 |
Cell temperature | 173 ± 2 K |
Ambient diffraction temperature | 173 ± 2 K |
Number of distinct elements | 7 |
Space group number | 14 |
Hermann-Mauguin space group symbol | P 1 21/n 1 |
Hall space group symbol | -P 2yn |
Residual factor for all reflections | 0.0497 |
Residual factor for significantly intense reflections | 0.0444 |
Weighted residual factors for significantly intense reflections | 0.1233 |
Weighted residual factors for all reflections included in the refinement | 0.1278 |
Goodness-of-fit parameter for all reflections included in the refinement | 1.029 |
Diffraction radiation wavelength | 1.54178 Å |
Diffraction radiation type | CuKα |