Information card for entry 7236002
Formula | C107 H90 B Cu3 F4 N2 O4 P6 |
Calculated formula | C107 H90 B Cu3 F4 N2 O4 P6 |
Title of publication | Assembly of BF4−, PF6−, ClO4− and F− with trinuclear copper(i) acetylide complexes bearing amide groups: structural diversity, photophysics and anion binding properties |
Authors of publication | Shi, Hua-Yun; Huang, Yong-Liang; Sun, Jia-Kai; Jiang, Ji-Jun; Luo, Zhi-Xing; Ling, Hui-Tao; Lam, Chi-Keung; Chao, Hsiu-Yi |
Journal of publication | RSC Advances |
Year of publication | 2015 |
Journal volume | 5 |
Journal issue | 109 |
Pages of publication | 89669 |
a | 22.36838 ± 0.00019 Å |
b | 34.9812 ± 0.0003 Å |
c | 25.4082 ± 0.0002 Å |
α | 90° |
β | 90.3117 ± 0.0008° |
γ | 90° |
Cell volume | 19880.9 ± 0.3 Å3 |
Cell temperature | 150 ± 2 K |
Ambient diffraction temperature | 150 ± 2 K |
Number of distinct elements | 8 |
Space group number | 14 |
Hermann-Mauguin space group symbol | P 1 21/c 1 |
Hall space group symbol | -P 2ybc |
Residual factor for all reflections | 0.1258 |
Residual factor for significantly intense reflections | 0.1195 |
Weighted residual factors for significantly intense reflections | 0.3058 |
Weighted residual factors for all reflections included in the refinement | 0.3089 |
Goodness-of-fit parameter for all reflections included in the refinement | 1.066 |
Diffraction radiation wavelength | 1.54184 Å |
Diffraction radiation type | CuKα |