Information card for entry 7236424
Formula | C31 H29 N5 O S |
Calculated formula | C31 H29 N5 O S |
Title of publication | Targeting mitochondrial DNA with a two-photon active Ru(ii) phenanthroline derivative |
Authors of publication | Wang, Hui; Tian, Xiaohe; Guan, Lijuan; Zhang, Qiong; Zhang, Shengyi; Zhou, Hongping; Wu, Jieying; Tian, Yupeng |
Journal of publication | Journal of Materials Chemistry B |
Year of publication | 2016 |
Journal volume | 4 |
Journal issue | 17 |
Pages of publication | 2895 |
a | 12.507 ± 0.005 Å |
b | 16.431 ± 0.005 Å |
c | 13.315 ± 0.005 Å |
α | 90 ± 0.005° |
β | 108.61 ± 0.005° |
γ | 90 ± 0.005° |
Cell volume | 2593.2 ± 1.6 Å3 |
Cell temperature | 298 ± 2 K |
Ambient diffraction temperature | 298 ± 2 K |
Number of distinct elements | 5 |
Space group number | 14 |
Hermann-Mauguin space group symbol | P 1 21/c 1 |
Hall space group symbol | -P 2ybc |
Residual factor for all reflections | 0.0761 |
Residual factor for significantly intense reflections | 0.0525 |
Weighted residual factors for significantly intense reflections | 0.1447 |
Weighted residual factors for all reflections included in the refinement | 0.1684 |
Goodness-of-fit parameter for all reflections included in the refinement | 0.965 |
Diffraction radiation wavelength | 0.71069 Å |
Diffraction radiation type | MoKα |