Information card for entry 7236425
Chemical name | POM-pyrene 1 |
Formula | C74 H108 N4 O19 V6 |
Calculated formula | C74 H108 N4 O19 V6 |
Title of publication | Layer-by-layer assembly of polyoxometalate‒pyrene-decorated fluorescent microspheres for the suspension immunoassay of Listeria monocytogenes |
Authors of publication | Ju, Wen; Song, Xiuling; Yan, Gang; Xu, Kun; Wang, Juan; Yin, Dehui; Li, Li; Qu, Xiaofeng; Li, Yangguang; Li, Juan |
Journal of publication | Journal of Materials Chemistry B |
Year of publication | 2016 |
Journal volume | 4 |
Journal issue | 24 |
Pages of publication | 4287 |
a | 12.5395 ± 0.0012 Å |
b | 24.454 ± 0.002 Å |
c | 25.013 ± 0.002 Å |
α | 90° |
β | 93.069 ± 0.002° |
γ | 90° |
Cell volume | 7659 ± 1.1 Å3 |
Cell temperature | 150 ± 2 K |
Ambient diffraction temperature | 150 ± 2 K |
Number of distinct elements | 5 |
Space group number | 15 |
Hermann-Mauguin space group symbol | C 1 2/c 1 |
Hall space group symbol | -C 2yc |
Residual factor for all reflections | 0.1293 |
Residual factor for significantly intense reflections | 0.0682 |
Weighted residual factors for significantly intense reflections | 0.1654 |
Weighted residual factors for all reflections included in the refinement | 0.2023 |
Goodness-of-fit parameter for all reflections included in the refinement | 1.001 |
Diffraction radiation wavelength | 0.71073 Å |
Diffraction radiation type | MoKα |