Information card for entry 7236427
Formula | C34 H25 N5 O |
Calculated formula | C34 H25 N5 O |
Title of publication | A two-photon fluorescent RNA probe screened from a series of oxime-functionalized 2,2′:6′,2′′-terpyridine ZnX2(X = Cl, Br, I) complexes |
Authors of publication | Wang, Hui; Tian, Xiaohe; Du, Wei; Zhang, Qiong; Guan, Lijuan; Wang, Aidong; Zhang, Yujin; Wang, Chuankui; Zhou, Hongping; Wu, Jieying; Tian, Yupeng |
Journal of publication | Journal of Materials Chemistry B |
Year of publication | 2016 |
Journal volume | 4 |
Journal issue | 28 |
Pages of publication | 4818 |
a | 8.8941 ± 0.0017 Å |
b | 10.241 ± 0.002 Å |
c | 15.811 ± 0.003 Å |
α | 79.53 ± 0.002° |
β | 86.87 ± 0.002° |
γ | 70.65 ± 0.002° |
Cell volume | 1336.1 ± 0.4 Å3 |
Cell temperature | 296 ± 2 K |
Ambient diffraction temperature | 296 ± 2 K |
Number of distinct elements | 4 |
Space group number | 2 |
Hermann-Mauguin space group symbol | P -1 |
Hall space group symbol | -P 1 |
Residual factor for all reflections | 0.1197 |
Residual factor for significantly intense reflections | 0.0789 |
Weighted residual factors for significantly intense reflections | 0.2216 |
Weighted residual factors for all reflections included in the refinement | 0.2498 |
Goodness-of-fit parameter for all reflections included in the refinement | 1.093 |
Diffraction radiation wavelength | 0.71073 Å |
Diffraction radiation type | MoKα |