Information card for entry 7236428
Formula | C35 H27 Br2 Cl2 N5 O Zn |
Calculated formula | C35 H27 Br2 Cl2 N5 O Zn |
Title of publication | A two-photon fluorescent RNA probe screened from a series of oxime-functionalized 2,2′:6′,2′′-terpyridine ZnX2(X = Cl, Br, I) complexes |
Authors of publication | Wang, Hui; Tian, Xiaohe; Du, Wei; Zhang, Qiong; Guan, Lijuan; Wang, Aidong; Zhang, Yujin; Wang, Chuankui; Zhou, Hongping; Wu, Jieying; Tian, Yupeng |
Journal of publication | Journal of Materials Chemistry B |
Year of publication | 2016 |
Journal volume | 4 |
Journal issue | 28 |
Pages of publication | 4818 |
a | 11.057 ± 0.005 Å |
b | 14.625 ± 0.005 Å |
c | 21.079 ± 0.005 Å |
α | 90 ± 0.005° |
β | 91.805 ± 0.005° |
γ | 90 ± 0.005° |
Cell volume | 3407 ± 2 Å3 |
Cell temperature | 298 ± 2 K |
Ambient diffraction temperature | 298 ± 2 K |
Number of distinct elements | 7 |
Space group number | 14 |
Hermann-Mauguin space group symbol | P 1 21/c 1 |
Hall space group symbol | -P 2ybc |
Residual factor for all reflections | 0.0936 |
Residual factor for significantly intense reflections | 0.0705 |
Weighted residual factors for significantly intense reflections | 0.2269 |
Weighted residual factors for all reflections included in the refinement | 0.2453 |
Goodness-of-fit parameter for all reflections included in the refinement | 1.09 |
Diffraction radiation wavelength | 0.71069 Å |
Diffraction radiation type | MoKα |