Information card for entry 7236434
Formula | C40 H33 N O3 |
Calculated formula | C40 H33 N O3 |
Title of publication | A photostable AIE fluorogen for lysosome-targetable imaging of living cells |
Authors of publication | Lou, Xiaoding; Zhang, Mengshi; Zhao, Zujin; Min, Xuehong; Hakeem, Abdul; Huang, Fujian; Gao, Pengcheng; Xia, Fan; Tang, Ben Zhong |
Journal of publication | Journal of Materials Chemistry B |
Year of publication | 2016 |
Journal volume | 4 |
Journal issue | 32 |
Pages of publication | 5412 |
a | 9.8545 ± 0.0004 Å |
b | 10.7534 ± 0.0005 Å |
c | 17.1587 ± 0.0008 Å |
α | 88.737 ± 0.004° |
β | 75.181 ± 0.004° |
γ | 63.066 ± 0.005° |
Cell volume | 1557.83 ± 0.15 Å3 |
Cell temperature | 173 ± 0.3 K |
Ambient diffraction temperature | 173 ± 0.3 K |
Number of distinct elements | 4 |
Space group number | 2 |
Hermann-Mauguin space group symbol | P -1 |
Hall space group symbol | -P 1 |
Residual factor for all reflections | 0.0402 |
Residual factor for significantly intense reflections | 0.0372 |
Weighted residual factors for significantly intense reflections | 0.1016 |
Weighted residual factors for all reflections included in the refinement | 0.1046 |
Goodness-of-fit parameter for all reflections included in the refinement | 1.002 |
Diffraction radiation probe | x-ray |
Diffraction radiation wavelength | 1.5418 Å |
Diffraction radiation type | CuKα |