Information card for entry 7236433
Formula | C27 H33 F6 N2 O4 P |
Calculated formula | C27 H33 F6 N2 O4 P |
Title of publication | A water-soluble two-photon fluorescence chemosensor for ratiometric imaging of mitochondrial viscosity in living cells |
Authors of publication | Zhao, Meng; Zhu, Yingzhong; Su, Jian; Geng, Qian; Tian, Xiaohe; Zhang, Jun; Zhou, Hongping; Zhang, Shengyi; Wu, Jieying; Tian, Yupeng |
Journal of publication | Journal of Materials Chemistry B |
Year of publication | 2016 |
Journal volume | 4 |
Journal issue | 35 |
Pages of publication | 5907 |
a | 10.82 ± 0.006 Å |
b | 11.364 ± 0.007 Å |
c | 12.581 ± 0.007 Å |
α | 90.262 ± 0.007° |
β | 91.648 ± 0.007° |
γ | 112.836 ± 0.007° |
Cell volume | 1424.9 ± 1.4 Å3 |
Cell temperature | 296 ± 2 K |
Ambient diffraction temperature | 296 ± 2 K |
Number of distinct elements | 6 |
Space group number | 2 |
Hermann-Mauguin space group symbol | P -1 |
Hall space group symbol | -P 1 |
Residual factor for all reflections | 0.1751 |
Residual factor for significantly intense reflections | 0.0829 |
Weighted residual factors for significantly intense reflections | 0.2277 |
Weighted residual factors for all reflections included in the refinement | 0.2624 |
Goodness-of-fit parameter for all reflections included in the refinement | 1.105 |
Diffraction radiation wavelength | 0.71073 Å |
Diffraction radiation type | MoKα |