Information card for entry 7236442
Formula | C33 H26 Cl2 N4 O Zn |
Calculated formula | C33 H26 Cl2 N4 O Zn |
Title of publication | A series of multifunctional coordination polymers based on terpyridine and zinc halide: second-harmonic generation and two-photon absorption properties and intracellular imaging |
Authors of publication | Su, Jian; Zhang, Jun; Tian, Xiaohe; Zhao, Meng; Song, Tao; Yu, Jiancan; Cui, Yuanjing; Qian, Guodong; Zhong, Hong; Luo, Lei; Zhang, Yujin; Wang, Chuankui; Li, Shengli; Yang, Jiaxiang; Zhou, Hongping; Wu, Jieying; Tian, Yupeng |
Journal of publication | Journal of Materials Chemistry B |
Year of publication | 2017 |
Journal volume | 5 |
Journal issue | 27 |
Pages of publication | 5458 |
a | 16.865 ± 0.002 Å |
b | 18.865 ± 0.002 Å |
c | 9.523 ± 0.0012 Å |
α | 90° |
β | 90° |
γ | 90° |
Cell volume | 3029.8 ± 0.6 Å3 |
Cell temperature | 291 ± 2 K |
Ambient diffraction temperature | 291 ± 2 K |
Number of distinct elements | 6 |
Space group number | 33 |
Hermann-Mauguin space group symbol | P n a 21 |
Hall space group symbol | P 2c -2n |
Residual factor for all reflections | 0.1021 |
Residual factor for significantly intense reflections | 0.05 |
Weighted residual factors for significantly intense reflections | 0.1105 |
Weighted residual factors for all reflections included in the refinement | 0.1274 |
Goodness-of-fit parameter for all reflections included in the refinement | 0.987 |
Diffraction radiation wavelength | 0.71073 Å |
Diffraction radiation type | MoKα |