Information card for entry 7236443
Formula | C53 H35 N3 |
Calculated formula | C53 H35 N3 |
Title of publication | Non-doped luminescent material based organic light-emitting devices displaying high brightness under very low driving voltage |
Authors of publication | Li, Chenglong; Wei, Jinbei; Song, Xiaoxian; Ye, Kaiqi; Zhang, Hongyu; Zhang, Jingying; Wang, Yue |
Journal of publication | Journal of Materials Chemistry C |
Year of publication | 2016 |
Journal volume | 4 |
Journal issue | 29 |
Pages of publication | 7013 |
a | 18.1453 ± 0.0019 Å |
b | 11.7409 ± 0.0012 Å |
c | 18.0797 ± 0.0019 Å |
α | 90° |
β | 106.363 ± 0.002° |
γ | 90° |
Cell volume | 3695.7 ± 0.7 Å3 |
Cell temperature | 273 ± 2 K |
Ambient diffraction temperature | 273 ± 2 K |
Number of distinct elements | 3 |
Space group number | 14 |
Hermann-Mauguin space group symbol | P 1 21/c 1 |
Hall space group symbol | -P 2ybc |
Residual factor for all reflections | 0.0699 |
Residual factor for significantly intense reflections | 0.0456 |
Weighted residual factors for significantly intense reflections | 0.0961 |
Weighted residual factors for all reflections included in the refinement | 0.1081 |
Goodness-of-fit parameter for all reflections included in the refinement | 1.035 |
Diffraction radiation wavelength | 0.71073 Å |
Diffraction radiation type | MoKα |