Information card for entry 7236523
Formula |
C22 H20 N2 O5 Zn |
Calculated formula |
C22 H20 N2 O5 Zn |
Title of publication |
Assembly of a series of zinc coordination polymers based on 5-functionalized isophthalic acids and dipyridyl |
Authors of publication |
Wang, Tao; Zhu, Rong-Rong; Zhang, Xiao-Feng; Yan, Tong; Wang, Quan; Feng, Jing; Zhou, Jie; Du, Lin; Zhao, Qi-Hua |
Journal of publication |
RSC Advances |
Year of publication |
2018 |
Journal volume |
8 |
Journal issue |
14 |
Pages of publication |
7428 |
a |
13.5909 ± 0.0016 Å |
b |
15.3382 ± 0.0018 Å |
c |
19.411 ± 0.002 Å |
α |
90° |
β |
90° |
γ |
90° |
Cell volume |
4046.4 ± 0.8 Å3 |
Cell temperature |
293 ± 2 K |
Ambient diffraction temperature |
293 ± 2 K |
Number of distinct elements |
5 |
Space group number |
61 |
Hermann-Mauguin space group symbol |
P b c a |
Hall space group symbol |
-P 2ac 2ab |
Residual factor for all reflections |
0.1146 |
Residual factor for significantly intense reflections |
0.0457 |
Weighted residual factors for significantly intense reflections |
0.0914 |
Weighted residual factors for all reflections included in the refinement |
0.1153 |
Goodness-of-fit parameter for all reflections included in the refinement |
0.987 |
Diffraction radiation wavelength |
0.71073 Å |
Diffraction radiation type |
MoKα |
Yes |
No |
No |