Information card for entry 7236524
Formula | C12 H44 O62 P12 Zn10 |
Calculated formula | C12 H44 O62 P12 Zn10 |
Title of publication | An acid-stable hexaphosphate ester based metal‒organic framework and its polymer composite as proton exchange membrane |
Authors of publication | Cai, Kun; Sun, Fuxing; Liang, Xiaoqiang; Liu, Cong; Zhao, Nian; Zou, Xiaoqin; Zhu, Guangshan |
Journal of publication | Journal of Materials Chemistry A |
Year of publication | 2017 |
Journal volume | 5 |
Journal issue | 25 |
Pages of publication | 12943 |
a | 11.962 ± 0.002 Å |
b | 14.897 ± 0.003 Å |
c | 22.54 ± 0.005 Å |
α | 104.12 ± 0.03° |
β | 91.11 ± 0.03° |
γ | 106.09 ± 0.03° |
Cell volume | 3726.3 ± 1.5 Å3 |
Cell temperature | 293 ± 2 K |
Ambient diffraction temperature | 293 ± 2 K |
Number of distinct elements | 5 |
Space group number | 2 |
Hermann-Mauguin space group symbol | P -1 |
Hall space group symbol | -P 1 |
Residual factor for all reflections | 0.1388 |
Residual factor for significantly intense reflections | 0.0786 |
Weighted residual factors for significantly intense reflections | 0.167 |
Weighted residual factors for all reflections included in the refinement | 0.1869 |
Goodness-of-fit parameter for all reflections included in the refinement | 1.002 |
Diffraction radiation wavelength | 0.71073 Å |
Diffraction radiation type | MoKα |