Information card for entry 7236682
Common name | none |
Formula | C12.25 H8 Cs In O9.75 S2 |
Calculated formula | C12 H4 Cs In O8 S2 |
Title of publication | An easily synthesized microporous framework material for the selective capture of radioactive Cs+ and Sr2+ ions |
Authors of publication | Gao, Yu-Jie; Feng, Mei-Ling; Zhang, Bo; Wu, Zhao-Feng; Song, Ying; Huang, Xiao-Ying |
Journal of publication | Journal of Materials Chemistry A |
Year of publication | 2018 |
Journal volume | 6 |
Journal issue | 9 |
Pages of publication | 3967 |
a | 13.6387 ± 0.0006 Å |
b | 13.6387 ± 0.0006 Å |
c | 15.1597 ± 0.0016 Å |
α | 90° |
β | 90° |
γ | 90° |
Cell volume | 2819.9 ± 0.3 Å3 |
Cell temperature | 100 ± 2 K |
Ambient diffraction temperature | 100 ± 2 K |
Number of distinct elements | 6 |
Space group number | 91 |
Hermann-Mauguin space group symbol | P 41 2 2 |
Hall space group symbol | P 4w 2c |
Residual factor for all reflections | 0.1424 |
Residual factor for significantly intense reflections | 0.093 |
Weighted residual factors for significantly intense reflections | 0.2028 |
Weighted residual factors for all reflections included in the refinement | 0.2321 |
Goodness-of-fit parameter for all reflections included in the refinement | 1.038 |
Diffraction radiation wavelength | 0.71073 Å |
Diffraction radiation type | MoKα |