Information card for entry 7236683
Formula | C11 H9 N O3 S |
Calculated formula | C11 H9 N O3 S |
Title of publication | Fabrication of egg shell-like nanovesicles from a thiocoumarin-based ε-amino ester: a potential carrier |
Authors of publication | Debnath, Mintu; Sasmal, Supriya; Haldar, Debasish |
Journal of publication | Journal of Materials Chemistry B |
Year of publication | 2017 |
Journal volume | 5 |
Journal issue | 27 |
Pages of publication | 5450 |
a | 6.7463 ± 0.0004 Å |
b | 21.3406 ± 0.0011 Å |
c | 7.0237 ± 0.0005 Å |
α | 90° |
β | 103.448 ± 0.006° |
γ | 90° |
Cell volume | 983.48 ± 0.11 Å3 |
Cell temperature | 100 ± 0.1 K |
Ambient diffraction temperature | 100 ± 0.1 K |
Number of distinct elements | 5 |
Space group number | 14 |
Hermann-Mauguin space group symbol | P 1 21/c 1 |
Hall space group symbol | -P 2ybc |
Residual factor for all reflections | 0.0577 |
Residual factor for significantly intense reflections | 0.0495 |
Weighted residual factors for significantly intense reflections | 0.1258 |
Weighted residual factors for all reflections included in the refinement | 0.132 |
Goodness-of-fit parameter for all reflections included in the refinement | 1.105 |
Diffraction radiation probe | x-ray |
Diffraction radiation wavelength | 0.71073 Å |
Diffraction radiation type | MoKα |