Information card for entry 7237264
Formula | C32 H22 O8 |
Calculated formula | C32 H22 O8 |
Title of publication | BINOL derivatives with aggression-induced emission |
Authors of publication | Shi, Lei; Li, Kun; Cui, Peng-Cheng; Li, Ling-Ling; Pan, Sheng-Lin; Li, Meng-Yang; Yu, Xiao-Qi |
Journal of publication | Journal of Materials Chemistry B |
Year of publication | 2018 |
Journal volume | 6 |
Journal issue | 27 |
Pages of publication | 4413 |
a | 12.7039 ± 0.0006 Å |
b | 13.6838 ± 0.0011 Å |
c | 20.0466 ± 0.0013 Å |
α | 71.882 ± 0.007° |
β | 78.624 ± 0.005° |
γ | 75.444 ± 0.006° |
Cell volume | 3178.8 ± 0.4 Å3 |
Cell temperature | 129.9 ± 0.4 K |
Ambient diffraction temperature | 129.9 ± 0.4 K |
Number of distinct elements | 3 |
Space group number | 1 |
Hermann-Mauguin space group symbol | P 1 |
Hall space group symbol | P 1 |
Residual factor for all reflections | 0.084 |
Residual factor for significantly intense reflections | 0.0564 |
Weighted residual factors for significantly intense reflections | 0.1454 |
Weighted residual factors for all reflections included in the refinement | 0.1626 |
Goodness-of-fit parameter for all reflections included in the refinement | 0.911 |
Diffraction radiation probe | x-ray |
Diffraction radiation wavelength | 0.71073 Å |
Diffraction radiation type | MoKα |