Information card for entry 7237265
Formula | C29 H28 N4 O4 |
Calculated formula | C29 H28 N4 O4 |
Title of publication | Real-time noninvasive monitoring of cell mortality using a two-photon emissive probe based on quaternary ammonium |
Authors of publication | Zhang, Mingzhu; Du, Wei; Tian, Xiaohe; Zhang, Ruilong; Zhao, Meng; Zhou, Hongping; Ding, Yaqi; Li, Lin; Wu, Jieying; Tian, Yupeng |
Journal of publication | Journal of Materials Chemistry B |
Year of publication | 2018 |
Journal volume | 6 |
Journal issue | 27 |
Pages of publication | 4417 |
a | 8.358 ± 0.002 Å |
b | 9.923 ± 0.002 Å |
c | 17.348 ± 0.004 Å |
α | 105.023 ± 0.003° |
β | 93.779 ± 0.003° |
γ | 109.005 ± 0.003° |
Cell volume | 1295.9 ± 0.5 Å3 |
Cell temperature | 296 ± 2 K |
Ambient diffraction temperature | 296 ± 2 K |
Number of distinct elements | 4 |
Space group number | 2 |
Hermann-Mauguin space group symbol | P -1 |
Hall space group symbol | -P 1 |
Residual factor for all reflections | 0.0707 |
Residual factor for significantly intense reflections | 0.0499 |
Weighted residual factors for significantly intense reflections | 0.1255 |
Weighted residual factors for all reflections included in the refinement | 0.1411 |
Goodness-of-fit parameter for all reflections included in the refinement | 0.971 |
Diffraction radiation wavelength | 0.71073 Å |
Diffraction radiation type | MoKα |