Information card for entry 7237266
Formula | C30 H30 Ag3 F9 N12 O10 S3 |
Calculated formula | C30 H30 Ag3 F9 N12 O10 S3 |
Title of publication | Anion directing self-assembly of 2D and 3D water-stable silver(i) cation metal organic frameworks and their applications in real-time discriminating cysteine and DNA detection |
Authors of publication | Wang, Xin Rui; Du, Jing; Huang, Zhuo; Liu, Kun; Liu, Yuan Yuan; Huo, Jian Zhong; Liu, Zhong Yi; Dong, Xiao Yu; Chen, Li Li; Ding, Bin |
Journal of publication | Journal of Materials Chemistry B |
Year of publication | 2018 |
Journal volume | 6 |
Journal issue | 28 |
Pages of publication | 4569 |
a | 20.2784 ± 0.0012 Å |
b | 11.6978 ± 0.0007 Å |
c | 20.667 ± 0.0012 Å |
α | 90° |
β | 115.464 ± 0.001° |
γ | 90° |
Cell volume | 4426.2 ± 0.5 Å3 |
Cell temperature | 173 ± 2 K |
Ambient diffraction temperature | 173 ± 2 K |
Number of distinct elements | 7 |
Space group number | 9 |
Hermann-Mauguin space group symbol | C 1 c 1 |
Hall space group symbol | C -2yc |
Residual factor for all reflections | 0.0318 |
Residual factor for significantly intense reflections | 0.0266 |
Weighted residual factors for significantly intense reflections | 0.0571 |
Weighted residual factors for all reflections included in the refinement | 0.0596 |
Goodness-of-fit parameter for all reflections included in the refinement | 1.019 |
Diffraction radiation wavelength | 0.71073 Å |
Diffraction radiation type | MoKα |