Information card for entry 7237628
Common name | 4F4Ph |
Formula | C46 H26 F4 |
Calculated formula | C46 H26 F4 |
Title of publication | Ambipolar transistors based on chloro-substituted tetraphenylpentacene |
Authors of publication | Sato, Ryonosuke; Eda, Shohei; Sugiyama, Haruki; Uekusa, Hidehiro; Hamura, Toshiyuki; Mori, Takehiko |
Journal of publication | Journal of Materials Chemistry C |
Year of publication | 2019 |
Journal volume | 7 |
Journal issue | 11 |
Pages of publication | 3294 |
a | 10.039 ± 0.0002 Å |
b | 13.07 ± 0.0002 Å |
c | 13.409 ± 0.0002 Å |
α | 112.658 ± 0.001° |
β | 103.943 ± 0.001° |
γ | 92.256 ± 0.001° |
Cell volume | 1558.51 ± 0.05 Å3 |
Cell temperature | 173 ± 2 K |
Ambient diffraction temperature | 173 ± 2 K |
Number of distinct elements | 3 |
Space group number | 2 |
Hermann-Mauguin space group symbol | P -1 |
Hall space group symbol | -P 1 |
Residual factor for all reflections | 0.1144 |
Residual factor for significantly intense reflections | 0.0677 |
Weighted residual factors for significantly intense reflections | 0.1814 |
Weighted residual factors for all reflections included in the refinement | 0.2312 |
Goodness-of-fit parameter for all reflections included in the refinement | 0.968 |
Diffraction radiation wavelength | 1.54186 Å |
Diffraction radiation type | CuKα |