Information card for entry 7237629
Formula | C52 H45 N2 O8 Tb Zn |
Calculated formula | C52 H45 N2 O8 Tb Zn |
Title of publication | Efficient white polymer light-emitting diodes (WPLEDs) based on double emitting layers of a PVK:Eu(iii)-complex and Alq3 |
Authors of publication | He, Yani; Liu, Lin; Fu, Guorui; Li, Wentao; Lü, Xingqiang; He, Hongshan; Wong, Wai-Yeung |
Journal of publication | Journal of Materials Chemistry C |
Year of publication | 2019 |
Journal volume | 7 |
Journal issue | 16 |
Pages of publication | 4800 |
a | 14.288 ± 0.005 Å |
b | 13.854 ± 0.005 Å |
c | 28.391 ± 0.01 Å |
α | 90° |
β | 103.983 ± 0.009° |
γ | 90° |
Cell volume | 5453 ± 3 Å3 |
Cell temperature | 296 ± 2 K |
Ambient diffraction temperature | 296.15 K |
Number of distinct elements | 6 |
Space group number | 14 |
Hermann-Mauguin space group symbol | P 1 21/n 1 |
Hall space group symbol | -P 2yn |
Residual factor for all reflections | 0.3187 |
Residual factor for significantly intense reflections | 0.111 |
Weighted residual factors for significantly intense reflections | 0.2437 |
Weighted residual factors for all reflections included in the refinement | 0.3314 |
Goodness-of-fit parameter for all reflections included in the refinement | 0.891 |
Diffraction radiation wavelength | 0.71073 Å |
Diffraction radiation type | MoKα |