Information card for entry 7237630
Formula | C22 H38 Co Dy N10 O9 |
Calculated formula | C22 H38 Co Dy N10 O9 |
Title of publication | Humidity driven molecular switch based on photoluminescent DyIIICoIII single-molecule magnets |
Authors of publication | Chorazy, Szymon; Zakrzewski, Jakub J.; Reczyński, Mateusz; Nakabayashi, Koji; Ohkoshi, Shin-ichi; Sieklucka, Barbara |
Journal of publication | Journal of Materials Chemistry C |
Year of publication | 2019 |
Journal volume | 7 |
Journal issue | 14 |
Pages of publication | 4164 |
a | 9.0161 ± 0.0005 Å |
b | 12.1545 ± 0.0009 Å |
c | 14.2631 ± 0.0008 Å |
α | 90.32 ± 0.006° |
β | 92.439 ± 0.006° |
γ | 91.052 ± 0.006° |
Cell volume | 1561.33 ± 0.17 Å3 |
Cell temperature | 200 ± 2 K |
Ambient diffraction temperature | 200 ± 2 K |
Number of distinct elements | 6 |
Space group number | 2 |
Hermann-Mauguin space group symbol | P -1 |
Hall space group symbol | -P 1 |
Residual factor for all reflections | 0.0867 |
Residual factor for significantly intense reflections | 0.0627 |
Weighted residual factors for significantly intense reflections | 0.0935 |
Weighted residual factors for all reflections included in the refinement | 0.1029 |
Goodness-of-fit parameter for all reflections included in the refinement | 1.143 |
Diffraction radiation probe | x-ray |
Diffraction radiation wavelength | 0.71075 Å |
Diffraction radiation type | MoKα |