Information card for entry 7237656
Formula |
C3 H2 N10 |
Calculated formula |
C3 H2 N10 |
Title of publication |
Multipurpose [1,2,4]triazolo[4,3-b][1,2,4,5] tetrazine-based energetic materials |
Authors of publication |
Liu, Yingle; Zhao, Gang; Tang, Yongxing; Zhang, Jichuan; Hu, Lu; Imler, Gregory H.; Parrish, Damon A.; Shreeve, Jean'ne M. |
Journal of publication |
Journal of Materials Chemistry A |
Year of publication |
2019 |
Journal volume |
7 |
Journal issue |
13 |
Pages of publication |
7875 |
a |
5.5258 ± 0.0004 Å |
b |
6.7155 ± 0.0005 Å |
c |
18.0885 ± 0.0014 Å |
α |
90° |
β |
90° |
γ |
90° |
Cell volume |
671.24 ± 0.09 Å3 |
Cell temperature |
296 ± 2 K |
Ambient diffraction temperature |
296 ± 2 K |
Number of distinct elements |
3 |
Space group number |
19 |
Hermann-Mauguin space group symbol |
P 21 21 21 |
Hall space group symbol |
P 2ac 2ab |
Residual factor for all reflections |
0.0356 |
Residual factor for significantly intense reflections |
0.0296 |
Weighted residual factors for significantly intense reflections |
0.0726 |
Weighted residual factors for all reflections included in the refinement |
0.0754 |
Goodness-of-fit parameter for all reflections included in the refinement |
1.057 |
Diffraction radiation wavelength |
0.71073 Å |
Diffraction radiation type |
MoKα |
Yes |
No |
No |