Information card for entry 7237657
Formula |
C3 H N11 O2 |
Calculated formula |
C3 H N11 O2 |
Title of publication |
Multipurpose [1,2,4]triazolo[4,3-b][1,2,4,5] tetrazine-based energetic materials |
Authors of publication |
Liu, Yingle; Zhao, Gang; Tang, Yongxing; Zhang, Jichuan; Hu, Lu; Imler, Gregory H.; Parrish, Damon A.; Shreeve, Jean'ne M. |
Journal of publication |
Journal of Materials Chemistry A |
Year of publication |
2019 |
Journal volume |
7 |
Journal issue |
13 |
Pages of publication |
7875 |
a |
5.5608 ± 0.0005 Å |
b |
18.9684 ± 0.0018 Å |
c |
7.5833 ± 0.0007 Å |
α |
90° |
β |
90.458 ± 0.002° |
γ |
90° |
Cell volume |
799.86 ± 0.13 Å3 |
Cell temperature |
296 ± 2 K |
Ambient diffraction temperature |
296 ± 2 K |
Number of distinct elements |
4 |
Space group number |
4 |
Hermann-Mauguin space group symbol |
P 1 21 1 |
Hall space group symbol |
P 2yb |
Residual factor for all reflections |
0.0507 |
Residual factor for significantly intense reflections |
0.0437 |
Weighted residual factors for significantly intense reflections |
0.1091 |
Weighted residual factors for all reflections included in the refinement |
0.1123 |
Goodness-of-fit parameter for all reflections included in the refinement |
1.091 |
Diffraction radiation wavelength |
0.71073 Å |
Diffraction radiation type |
MoKα |
Yes |
No |
No |